Reaction Details
TargetCholecystokinin receptor type A
LigandBDBM50286163
Substrate/Competitorn/a
Meas. Tech.ChEBML_49403
IC50 500±n/a nM
Citation Holladay, MWBennett, MJBai, HRalston, JWKerwin, JFStashko, MMiller, TRO'Neill, ABNadzan, AMBrioni, JLin, CW Amino acid-derived piperidides as novel CCKB ligands with anxiolytic-like properties Bioorg Med Chem Lett5:3057-3062 (1995)    Article
 
Cholecystokinin receptor type A
Name:Cholecystokinin receptor type A
Type:n/a
Mol. Mass.:48229.77
Organism:Cavia porcellus
Description:n/a
Residue:430
BDBM50286163
NameBDBM50286163
Synonyms:1-[(R)-3-Benzyloxy-2-(3-m-tolyl-ureido)-propionyl]-piperidine-4-carboxylic acid phenylamide | CHEMBL322913
TypeSmall organic molecule
Emp. Form.C30H34N4O4
Mol. Mass.514.6154
SMILESCc1cccc(NC(=O)N[C@H](COCc2ccccc2)C(=O)N2CCC(CC2)C(=O)Nc2ccccc2)c1