Reaction Details
TargetCholecystokinin receptor type A
LigandBDBM50286177
Substrate/Competitorn/a
Meas. Tech.ChEBML_49403
IC50 1500±n/a nM
Citation Holladay, MWBennett, MJBai, HRalston, JWKerwin, JFStashko, MMiller, TRO'Neill, ABNadzan, AMBrioni, JLin, CW Amino acid-derived piperidides as novel CCKB ligands with anxiolytic-like properties Bioorg Med Chem Lett5:3057-3062 (1995)    Article
 
Cholecystokinin receptor type A
Name:Cholecystokinin receptor type A
Type:n/a
Mol. Mass.:48229.77
Organism:Cavia porcellus
Description:n/a
Residue:430
BDBM50286177
NameBDBM50286177
Synonyms:CHEMBL104958 | Morpholine-4-carboxylic acid (R)-3-(4-benzoyl-piperidin-1-yl)-3-oxo-2-(3-m-tolyl-ureido)-propyl ester
TypeSmall organic molecule
Emp. Form.C28H34N4O6
Mol. Mass.522.5928
SMILESCc1cccc(NC(=O)N[C@H](COC(=O)N2CCOCC2)C(=O)N2CCC(CC2)C(=O)c2ccccc2)c1