Reaction Details
TargetCholecystokinin receptor type A
LigandBDBM50286168
Substrate/Competitorn/a
Meas. Tech.ChEBML_49403
IC50 200±n/a nM
Citation Holladay, MWBennett, MJBai, HRalston, JWKerwin, JFStashko, MMiller, TRO'Neill, ABNadzan, AMBrioni, JLin, CW Amino acid-derived piperidides as novel CCKB ligands with anxiolytic-like properties Bioorg Med Chem Lett5:3057-3062 (1995)    Article
 
Cholecystokinin receptor type A
Name:Cholecystokinin receptor type A
Type:n/a
Mol. Mass.:48229.77
Organism:Cavia porcellus
Description:n/a
Residue:430
BDBM50286168
NameBDBM50286168
Synonyms:CHEMBL321072 | [(S)-1-[(S)-1-(4-Benzyl-piperidine-1-carbonyl)-3-methyl-butylcarbamoyl]-2-(1H-indol-3-yl)-ethyl]-carbamic acid tert-butyl ester
TypeSmall organic molecule
Emp. Form.C34H46N4O4
Mol. Mass.574.7534
SMILESCC(C)C[C@H](NC(=O)[C@H](Cc1c[nH]c2ccccc12)NC(=O)OC(C)(C)C)C(=O)N1CCC(Cc2ccccc2)CC1