Reaction Details
TargetPlatelet-activating factor receptor
LigandBDBM50286211
Substrate/Competitorn/a
Meas. Tech.ChEBML_164930
IC50 6.5±n/a nM
Citation Cooper, KFray, MJParry, MJRichardson, KSteele, J Enantiodifferentiation of dihydropyridine PAF antagonists Bioorg Med Chem Lett5:3085-3090 (1995)    Article
 
Platelet-activating factor receptor
Name:Platelet-activating factor receptor
Type:Enzyme Catalytic Domain
Mol. Mass.:39219.60
Organism:Homo sapiens (Human)
Description:PAF Platelet activating factor PTAFR HUMAN::P25105
Residue:342
BDBM50286211
NameBDBM50286211
Synonyms:4-(2-Chloro-phenyl)-6-methyl-2-[2-(2-methyl-imidazo[4,5-b]pyridin-1-yl)-ethoxymethyl]-5-(pyridin-2-ylcarbamoyl)-1,4-dihydro-pyridine-3-carboxylic acid ethyl ester | CHEMBL322029
TypeSmall organic molecule
Emp. Form.C31H31ClN6O4
Mol. Mass.587.069
SMILESCCOC(=O)C1=C(COCCn2c(C)nc3ncccc23)N=C(C)C(C1c1ccccc1Cl)C(=O)Nc1ccccn1