Reaction Details
TargetCysteinyl leukotriene receptor 1
LigandBDBM50009073
Substrate/Competitorn/a
Meas. Tech.ChEBML_99860
IC50 0.440000±n/a nM
Citation Labelle, MBelley, MGareau, YGauthier, JYGuay, DGordon, RGrossman, SGJones, TRLeblanc, YMcAuliffe, MMcFarlane, CMasson, PMetters, KMOuimet, NPatrick, DHPiechuta, HRochette, CSawyer, NXiang, YBPickett, CB Discovery of MK-0476, a potent and orally active leukotriene D4 receptor antagonist devoid of peroxisomal enxyme induction Bioorg Med Chem Lett5:283-288 (1995)    Article
 
Cysteinyl leukotriene receptor 1
Name:Cysteinyl leukotriene receptor 1
Type:Enzyme Catalytic Domain
Mol. Mass.:39007.58
Organism:GUINEA PIG
Description:Leukotriene D4 0 GUINEA PIG::Q2NNR5
Residue:340
BDBM50009073
NameBDBM50009073
Synonyms:4-(5-cyclopentyloxycarbonylamino-1-methyl-1H-indol-3-ylmethyl)-3-methoxy-N-o-tolylsulfonylbenzamide ZAFIRLUKAST cyclopentyl 3-[2-methoxy-4-(2-methylphenylsulfonylcarbamoyl)benzyl]-1-methyl-1H-indol-5-ylcarbamate
TypeSmall organic molecule
Emp. Form.C31H33N3O6S
Mol. Mass.575.675
SMILESCOc1cc(ccc1Cc1cn(C)c2ccc(NC(=O)OC3CCCC3)cc12)C(=O)NS(=O)(=O)c1ccccc1C