Reaction Details
TargetCysteinyl leukotriene receptor 1
LigandBDBM50052019
Substrate/Competitorn/a
Meas. Tech.ChEBML_99860
IC50 1.5±n/a nM
Citation Labelle, MBelley, MGareau, YGauthier, JYGuay, DGordon, RGrossman, SGJones, TRLeblanc, YMcAuliffe, MMcFarlane, CMasson, PMetters, KMOuimet, NPatrick, DHPiechuta, HRochette, CSawyer, NXiang, YBPickett, CB Discovery of MK-0476, a potent and orally active leukotriene D4 receptor antagonist devoid of peroxisomal enxyme induction Bioorg Med Chem Lett5:283-288 (1995)    Article
 
Cysteinyl leukotriene receptor 1
Name:Cysteinyl leukotriene receptor 1
Type:Enzyme Catalytic Domain
Mol. Mass.:39007.58
Organism:GUINEA PIG
Description:Leukotriene D4 0 GUINEA PIG::Q2NNR5
Residue:340
BDBM50052019
NameBDBM50052019
Synonyms:CHEMBL89768 MK-571 Sodium;3-[{3-[(E)-2-(7-chloro-quinolin-2-yl)-vinyl]-phenyl}-(2-dimethylcarbamoyl-ethylsulfanyl)-methylsulfanyl]-propionate | sodium (E)-3-((3-(2-(7-chloroquinolin-2-yl)vinyl)phenyl)(3-(dimethylamino)-3-oxopropylthio)methylthio)propanoate
TypeSmall organic molecule
Emp. Form.C26H26ClN2O3S2
Mol. Mass.514.08
SMILESCN(C)C(=O)CCSC(SCCC([O-])=O)c1cccc(\C=C\c2ccc3ccc(Cl)cc3n2)c1