Reaction Details
TargetNeutrophil elastase
LigandBDBM50286307
Substrate/Competitorn/a
Meas. Tech.ChEBML_219643
Ki 1.6±n/a nM
Citation Subramanyam, CBell, MRFerguson, EGordon, RGDunlap, RPFranke, CMura, AJ Inhibitors of human leukocyte elastase. 2.1 synthesis and sar of benzisothiazolinylmethyl aryl ethers Bioorg Med Chem Lett5:319-324 (1995)    Article
 
Neutrophil elastase
Name:Neutrophil elastase
Type:Enzyme
Mol. Mass.:28532.38
Organism:Homo sapiens (Human)
Description:P08246
Residue:267
BDBM50286307
NameBDBM50286307
Synonyms:2,6-Dichloro-4-(4-isopropyl-1,1,3-trioxo-1,3-dihydro-1lambda*6*-benzo[d]isothiazol-2-ylmethoxy)-benzoic acid 2-morpholin-4-yl-ethyl ester | CHEMBL109411
TypeSmall organic molecule
Emp. Form.C24H26Cl2N2O7S
Mol. Mass.557.443
SMILESCC(C)c1cccc2c1C(=O)N(COc1cc(Cl)c(C(=O)OCCN3CCOCC3)c(Cl)c1)S2(=O)=O