Reaction Details
TargetNeutrophil elastase
LigandBDBM50286322
Substrate/Competitorn/a
Meas. Tech.ChEBML_86691
Ki 0.700000±n/a nM
Citation Subramanyam, CBell, MRGhose, AKKumar, VDunlap, RPFranke, CMura, AJ Inhibitors of human leukocyte elastase. 3.1 inhibition by tetrahydrobenzisothiazolinylmethyl aryl carboxylates Bioorg Med Chem Lett5:325-330 (1995)    Article
 
Neutrophil elastase
Name:Neutrophil elastase
Type:Enzyme
Mol. Mass.:28532.38
Organism:Homo sapiens (Human)
Description:P08246
Residue:267
BDBM50286322
NameBDBM50286322
Synonyms:2,6-Dichloro-benzoic acid 4-ethyl-1,1,3-trioxo-1,3,4,5,6,7-hexahydro-1lambda*6*-benzo[d]isothiazol-2-ylmethyl ester | CHEMBL326848
TypeSmall organic molecule
Emp. Form.C17H17Cl2NO5S
Mol. Mass.418.292
SMILESCCC1CCCC2=C1C(=O)N(COC(=O)c1c(Cl)cccc1Cl)S2(=O)=O