Reaction Details
TargetNeutrophil elastase
LigandBDBM50039636
Substrate/Competitorn/a
Meas. Tech.ChEMBL_86707 (CHEMBL693299)
Ki 2±n/a nM
Citation Subramanyam, CBell, MRGhose, AKKumar, VDunlap, RPFranke, CMura, AJ Inhibitors of human leukocyte elastase. 3.1 inhibition by tetrahydrobenzisothiazolinylmethyl aryl carboxylates Bioorg Med Chem Lett5:325-330 (1995)    Article
 
Neutrophil elastase
Name:Neutrophil elastase
Type:Enzyme
Mol. Mass.:28532.38
Organism:Homo sapiens (Human)
Description:P08246
Residue:267
BDBM50039636
NameBDBM50039636
Synonyms:2,6-Dichloro-benzoic acid 1,1,3-trioxo-1,3-dihydro-1lambda*6*-benzo[d]isothiazol-2-ylmethyl ester | CHEMBL274085
TypeSmall organic molecule
Emp. Form.C15H9Cl2NO5S
Mol. Mass.386.207
SMILESClc1cccc(Cl)c1C(=O)OCN1C(=O)c2ccccc2S1(=O)=O