Reaction Details
TargetNeutrophil elastase
LigandBDBM50039631
Substrate/Competitorn/a
Meas. Tech.ChEMBL_86707 (CHEMBL693299)
Ki 0.030200±n/a nM
Citation Subramanyam, CBell, MRGhose, AKKumar, VDunlap, RPFranke, CMura, AJ Inhibitors of human leukocyte elastase. 3.1 inhibition by tetrahydrobenzisothiazolinylmethyl aryl carboxylates Bioorg Med Chem Lett5:325-330 (1995)    Article
 
Neutrophil elastase
Name:Neutrophil elastase
Type:Enzyme
Mol. Mass.:28532.38
Organism:Homo sapiens (Human)
Description:P08246
Residue:267
BDBM50039631
NameBDBM50039631
Synonyms:2,6-Dichloro-benzoic acid 4-isopropyl-1,1,3-trioxo-1,3-dihydro-1lambda*6*-benzo[d]isothiazol-2-ylmethyl ester | CHEMBL314218
TypeSmall organic molecule
Emp. Form.C18H15Cl2NO5S
Mol. Mass.428.286
SMILESCC(C)c1cccc2c1C(=O)N(COC(=O)c1c(Cl)cccc1Cl)S2(=O)=O