Reaction Details
TargetNeutrophil elastase
LigandBDBM50286328
Substrate/Competitorn/a
Meas. Tech.ChEBML_86695
Ki 2.2±n/a nM
Citation Hlasta, DJBell, MRCourt, JJCundy, KCDesai, RCFerguson, EWGordon, RJKumar, VMaycock, ALSubramanyam, CDunlap, RPEiff, SLFranke, CAMura, AJRowlands, AG The design of potent and stable benzisothiazolone inhibitors of human leukocyte elastase Bioorg Med Chem Lett5:331-336 (1995)    Article
 
Neutrophil elastase
Name:Neutrophil elastase
Type:Enzyme
Mol. Mass.:28532.38
Organism:Homo sapiens (Human)
Description:P08246
Residue:267
BDBM50286328
NameBDBM50286328
Synonyms:2,6-Dichloro-benzoic acid 6-dimethylamino-4-isopropyl-1,1,3-trioxo-1,3-dihydro-1lambda*6*-benzo[d]isothiazol-2-ylmethyl ester | CHEMBL323694
TypeSmall organic molecule
Emp. Form.C20H20Cl2N2O5S
Mol. Mass.471.354
SMILESCC(C)c1cc(cc2c1C(=O)N(COC(=O)c1c(Cl)cccc1Cl)S2(=O)=O)N(C)C