Reaction Details
TargetNeutrophil elastase
LigandBDBM50286332
Substrate/Competitorn/a
Meas. Tech.ChEBML_86695
Ki 5.2±n/a nM
Citation Hlasta, DJBell, MRCourt, JJCundy, KCDesai, RCFerguson, EWGordon, RJKumar, VMaycock, ALSubramanyam, CDunlap, RPEiff, SLFranke, CAMura, AJRowlands, AG The design of potent and stable benzisothiazolone inhibitors of human leukocyte elastase Bioorg Med Chem Lett5:331-336 (1995)    Article
 
Neutrophil elastase
Name:Neutrophil elastase
Type:Enzyme
Mol. Mass.:28532.38
Organism:Homo sapiens (Human)
Description:P08246
Residue:267
BDBM50286332
NameBDBM50286332
Synonyms:4-Isopropyl-5,6-dimethoxy-1,1-dioxo-2-(1-phenyl-1H-tetrazol-5-ylsulfanylmethyl)-1,2-dihydro-1lambda*6*-benzo[d]isothiazol-3-one | CHEMBL112205
TypeSmall organic molecule
Emp. Form.C20H21N5O5S2
Mol. Mass.475.541
SMILESCOc1cc2c(C(=O)N(CSc3nnnn3-c3ccccc3)S2(=O)=O)c(C(C)C)c1OC