Reaction Details
TargetNeutrophil elastase
LigandBDBM50282878
Substrate/Competitorn/a
Meas. Tech.ChEMBL_86690 (CHEMBL694281)
Ki 14±n/a nM
Citation Hlasta, DJBell, MRCourt, JJCundy, KCDesai, RCFerguson, EWGordon, RJKumar, VMaycock, ALSubramanyam, CDunlap, RPEiff, SLFranke, CAMura, AJRowlands, AG The design of potent and stable benzisothiazolone inhibitors of human leukocyte elastase Bioorg Med Chem Lett5:331-336 (1995)    Article
 
Neutrophil elastase
Name:Neutrophil elastase
Type:Enzyme
Mol. Mass.:28532.38
Organism:Homo sapiens (Human)
Description:P08246
Residue:267
BDBM50282878
NameBDBM50282878
Synonyms:4-Methoxy-1,1-dioxo-2-(1-phenyl-1H-tetrazol-5-ylsulfanylmethyl)-1,2-dihydro-1lambda*6*-benzo[d]isothiazol-3-one | CHEMBL432890
TypeSmall organic molecule
Emp. Form.C16H13N5O4S2
Mol. Mass.403.436
SMILESCOc1cccc2c1C(=O)N(CSc1nnnn1-c1ccccc1)S2(=O)=O