Reaction Details
TargetInterstitial collagenase
LigandBDBM50286336
Substrate/Competitorn/a
Meas. Tech.ChEBML_49511
Ki 5±n/a nM
Citation Singh, JConzentino, PCundy, KGainor, JAGilliam, CLGordon, TDJohnson, JAMorgan, BASchneider, EDWahl, RCWhipple, DA Relationship between structure and bioavailability in a series of hydroxamate based metalloprotease inhibitors Bioorg Med Chem Lett5:337-342 (1995)    Article
 
Interstitial collagenase
Name:Interstitial collagenase
Type:Enzyme
Mol. Mass.:54010.26
Organism:Homo sapiens (Human)
Description: P03956
Residue:469
BDBM50286336
NameBDBM50286336
Synonyms:(R)-N*4*-Hydroxy-N*1*-[(S)-2-(1H-indol-3-yl)-1-(2-methoxy-ethylcarbamoyl)-ethyl]-2-isobutyl-succinamide | CHEMBL114665
TypeSmall organic molecule
Emp. Form.C22H32N4O5
Mol. Mass.432.5133
SMILESCOCCNC(=O)[C@H](Cc1c[nH]c2ccccc12)NC(=O)[C@H](CC(C)C)CC(=O)NO