Reaction Details
TargetInterstitial collagenase
LigandBDBM50286337
Substrate/Competitorn/a
Meas. Tech.ChEBML_49511
Ki 2±n/a nM
Citation Singh, JConzentino, PCundy, KGainor, JAGilliam, CLGordon, TDJohnson, JAMorgan, BASchneider, EDWahl, RCWhipple, DA Relationship between structure and bioavailability in a series of hydroxamate based metalloprotease inhibitors Bioorg Med Chem Lett5:337-342 (1995)    Article
 
Interstitial collagenase
Name:Interstitial collagenase
Type:Enzyme
Mol. Mass.:54010.26
Organism:Homo sapiens (Human)
Description: P03956
Residue:469
BDBM50286337
NameBDBM50286337
Synonyms:(R)-N*4*-Hydroxy-N*1*-[(S)-2-(1H-indol-3-yl)-1-(2-methanesulfinyl-ethylcarbamoyl)-ethyl]-2-isobutyl-succinamide | CHEMBL116676
TypeSmall organic molecule
Emp. Form.C22H32N4O5S
Mol. Mass.464.578
SMILESCC(C)C[C@H](CC(=O)NO)C(=O)N[C@@H](Cc1c[nH]c2ccccc12)C(=O)NCCS(C)=O