Reaction Details
TargetInterstitial collagenase
LigandBDBM50286343
Substrate/Competitorn/a
Meas. Tech.ChEBML_49511
Ki 4±n/a nM
Citation Singh, JConzentino, PCundy, KGainor, JAGilliam, CLGordon, TDJohnson, JAMorgan, BASchneider, EDWahl, RCWhipple, DA Relationship between structure and bioavailability in a series of hydroxamate based metalloprotease inhibitors Bioorg Med Chem Lett5:337-342 (1995)    Article
 
Interstitial collagenase
Name:Interstitial collagenase
Type:Enzyme
Mol. Mass.:54010.26
Organism:Homo sapiens (Human)
Description: P03956
Residue:469
BDBM50286343
NameBDBM50286343
Synonyms:(R)-N*1*-[(S)-1-(4-Dimethylaminomethyl-benzylcarbamoyl)-2-(1H-indol-3-yl)-ethyl]-N*4*-hydroxy-2-isobutyl-succinamide | CHEMBL324023
TypeSmall organic molecule
Emp. Form.C29H39N5O4
Mol. Mass.521.6511
SMILESCC(C)C[C@H](CC(=O)NO)C(=O)N[C@@H](Cc1c[nH]c2ccccc12)C(=O)NCc1ccc(CN(C)C)cc1