Reaction Details
TargetInterstitial collagenase
LigandBDBM50286345
Substrate/Competitorn/a
Meas. Tech.ChEBML_49511
Ki 3±n/a nM
Citation Singh, JConzentino, PCundy, KGainor, JAGilliam, CLGordon, TDJohnson, JAMorgan, BASchneider, EDWahl, RCWhipple, DA Relationship between structure and bioavailability in a series of hydroxamate based metalloprotease inhibitors Bioorg Med Chem Lett5:337-342 (1995)    Article
 
Interstitial collagenase
Name:Interstitial collagenase
Type:Enzyme
Mol. Mass.:54010.26
Organism:Homo sapiens (Human)
Description: P03956
Residue:469
BDBM50286345
NameBDBM50286345
Synonyms:(R)-N*1*-[(S)-1-(4-Dimethylamino-butylcarbamoyl)-2-(1H-indol-3-yl)-ethyl]-N*4*-hydroxy-2-isobutyl-succinamide | CHEMBL324140
TypeSmall organic molecule
Emp. Form.C25H39N5O4
Mol. Mass.473.6083
SMILESCC(C)C[C@H](CC(=O)NO)C(=O)N[C@@H](Cc1c[nH]c2ccccc12)C(=O)NCCCCN(C)C