Reaction Details
TargetMatrix metalloproteinase-9
LigandBDBM50286352
Substrate/Competitorn/a
Meas. Tech.ChEBML_105391
Ki 11±n/a nM
Citation Wahl, RCPulvino, TAMathiowetz, AMGhose, AKJohnson, JSDelecki, DCook, ERGainor, JAGowravaram, MRTomczuk, BE Hydroxamate inhibitors of human gelatinase B (92 kDa) Bioorg Med Chem Lett5:349-352 (1995)    Article
 
Matrix metalloproteinase-9
Name:Matrix metalloproteinase-9
Type:Enzyme
Mol. Mass.:78452.28
Organism:Homo sapiens (Human)
Description:P14780
Residue:707
BDBM50286352
NameBDBM50286352
Synonyms:(R)-2-(4-Benzyloxy-butyl)-N*1*-((S)-2,2-dimethyl-1-methylcarbamoyl-propyl)-N*4*-hydroxy-succinamide | CHEMBL325015
TypeSmall organic molecule
Emp. Form.C22H35N3O5
Mol. Mass.421.5304
SMILESCNC(=O)[C@@H](NC(=O)[C@H](CCCCOCc1ccccc1)CC(=O)NO)C(C)(C)C