Reaction Details
TargetStromelysin-1
LigandBDBM50286353
Substrate/Competitorn/a
Meas. Tech.ChEBML_102092
Ki 40000±n/a nM
Citation Wahl, RCPulvino, TAMathiowetz, AMGhose, AKJohnson, JSDelecki, DCook, ERGainor, JAGowravaram, MRTomczuk, BE Hydroxamate inhibitors of human gelatinase B (92 kDa) Bioorg Med Chem Lett5:349-352 (1995)    Article
 
Stromelysin-1
Name:Stromelysin-1
Type:Enzyme
Mol. Mass.:53973.13
Organism:Homo sapiens (Human)
Description: P08254
Residue:477
BDBM50286353
NameBDBM50286353
Synonyms:(R)-N*4*-Hydroxy-N*1*-[(S)-2-(1H-indol-3-yl)-1-methylcarbamoyl-ethyl]-2-methyl-succinamide | CHEMBL332891
TypeSmall organic molecule
Emp. Form.C17H22N4O4
Mol. Mass.346.381
SMILESCNC(=O)[C@H](Cc1c[nH]c2ccccc12)NC(=O)[C@H](C)CC(=O)NO