Reaction Details
TargetInterstitial collagenase
LigandBDBM50031795
Substrate/Competitorn/a
Meas. Tech.ChEBML_101763
Ki 6±n/a nM
Citation Wahl, RCPulvino, TAMathiowetz, AMGhose, AKJohnson, JSDelecki, DCook, ERGainor, JAGowravaram, MRTomczuk, BE Hydroxamate inhibitors of human gelatinase B (92 kDa) Bioorg Med Chem Lett5:349-352 (1995)    Article
 
Interstitial collagenase
Name:Interstitial collagenase
Type:Enzyme
Mol. Mass.:54010.26
Organism:Homo sapiens (Human)
Description: P03956
Residue:469
BDBM50031795
NameBDBM50031795
Synonyms:(N-(2-HYDROXAMATEMETHYLENE-4-METHYL-PENTOYL)PHENYLALANYL)METHYL AMINE (R)-N4-hydroxy-2-isobutyl-N1-((S)-1-(methylamino)-1-oxo-3-phenylpropan-2-yl)succinamide METHYLAMINO-PHENYLALANYL-LEUCYL-HYDROXAMIC ACID
TypeSmall organic molecule
Emp. Form.C18H27N3O4
Mol. Mass.349.4247
SMILESCNC(=O)[C@H](Cc1ccccc1)NC(=O)[C@H](CC(C)C)CC(=O)NO