Reaction Details
TargetNeutrophil collagenase
LigandBDBM50286355
Substrate/Competitorn/a
Meas. Tech.ChEBML_105200
Ki 100±n/a nM
Citation Wahl, RCPulvino, TAMathiowetz, AMGhose, AKJohnson, JSDelecki, DCook, ERGainor, JAGowravaram, MRTomczuk, BE Hydroxamate inhibitors of human gelatinase B (92 kDa) Bioorg Med Chem Lett5:349-352 (1995)    Article
 
Neutrophil collagenase
Name:Neutrophil collagenase
Type:Enzyme
Mol. Mass.:53413.48
Organism:Homo sapiens (Human)
Description:P22894
Residue:467
BDBM50286355
NameBDBM50286355
Synonyms:(R)-2-Ethyl-N*4*-hydroxy-N*1*-[(S)-2-(1H-indol-3-yl)-1-methylcarbamoyl-ethyl]-succinamide | CHEMBL324369
TypeSmall organic molecule
Emp. Form.C18H24N4O4
Mol. Mass.360.4076
SMILESCC[C@H](CC(=O)NO)C(=O)N[C@@H](Cc1c[nH]c2ccccc12)C(=O)NC