Reaction Details
TargetCalpain-1 catalytic subunit
LigandBDBM50286432
Substrate/Competitorn/a
Meas. Tech.ChEBML_43649
IC50 500±n/a nM
Citation Graybill, TLDolle, REOsifo, IKSchmidt, SJGregory, JSHarris, ALMiller, MS Inhibition of human erythrocyte calpain I by novel quinolinecarboxamides Bioorg Med Chem Lett5:387-392 (1995)    Article
 
Calpain-1 catalytic subunit
Name:Calpain-1 catalytic subunit
Type:Protein
Mol. Mass.:81880.51
Organism:Homo sapiens (Human)
Description:n/a
Residue:714
BDBM50286432
NameBDBM50286432
Synonyms:1-(4-Hydroxy-2-methyl-phenyl)-4-oxo-7-pyridin-4-yl-1,4-dihydro-quinoline-3-carboxylic acid amide | CHEMBL340921
TypeSmall organic molecule
Emp. Form.C22H17N3O3
Mol. Mass.371.3887
SMILESCc1cc(O)ccc1-n1cc(C(N)=O)c(=O)c2ccc(cc12)-c1ccncc1