Reaction Details
TargetCalpain-1 catalytic subunit
LigandBDBM50286438
Substrate/Competitorn/a
Meas. Tech.ChEBML_43649
IC50 20000±n/a nM
Citation Graybill, TLDolle, REOsifo, IKSchmidt, SJGregory, JSHarris, ALMiller, MS Inhibition of human erythrocyte calpain I by novel quinolinecarboxamides Bioorg Med Chem Lett5:387-392 (1995)    Article
 
Calpain-1 catalytic subunit
Name:Calpain-1 catalytic subunit
Type:Protein
Mol. Mass.:81880.51
Organism:Homo sapiens (Human)
Description:n/a
Residue:714
BDBM50286438
NameBDBM50286438
Synonyms:1-(4-Hydroxy-2-trifluoromethyl-phenyl)-4-oxo-7-pyridin-4-yl-1,4-dihydro-quinoline-3-carboxylic acid amide | CHEMBL339558
TypeSmall organic molecule
Emp. Form.C22H14F3N3O3
Mol. Mass.425.3601
SMILESNC(=O)c1cn(-c2ccc(O)cc2C(F)(F)F)c2cc(ccc2c1=O)-c1ccncc1