Reaction Details
TargetCalpain small subunit 1/1 catalytic subunit
LigandBDBM50286450
Substrate/Competitorn/a
Meas. Tech.ChEMBL_43696 (CHEMBL653673)
IC50 400±n/a nM
Citation Harris, ALGregory, JSMaycock, ALGraybill, TLOsifo, IKSchmidt, SJDolle, RE Characterization of a continuous fluorogenic assay for calpain I. Kinetic evaluation of peptide aldehydes, halomethyl ketones and (acyloxy)methyl ketones as inhibitors of the enzyme Bioorg Med Chem Lett5:393-398 (1995)    Article
 
Calpain small subunit 1/1 catalytic subunit
Name:Calpain small subunit 1/1 catalytic subunit
Type:n/a
Mol. Mass.:n/a
Description:ASSAY_ID of EBI is 43671
Components:This complex has 2 components.
Component 1
Name:Calpain small subunit 1
Synonyms:CAPN4 CAPNS1 Calpain 1
Type:PROTEIN
Mol. Mass.:28309.36
Organism:Homo sapiens (Human)
Description:EBI_12682
Residue:268
Component 2
Name:Calpain-1 catalytic subunit
Synonyms:CAN1_HUMAN CAPN1 Calpain-1 (u-Calpain) Calpain1
Type:Protein
Mol. Mass.:81880.51
Organism:Homo sapiens (Human)
Description:n/a
Residue:714
BDBM50286450
NameBDBM50286450
Synonyms:CHEMBL128135 | [(S)-1-((S)-1-Benzyl-2-oxo-ethylcarbamoyl)-2-phenyl-ethyl]-carbamic acid benzyl ester
TypeSmall organic molecule
Emp. Form.C26H26N2O4
Mol. Mass.430.4956
SMILESO=C[C@H](Cc1ccccc1)NC(=O)[C@H](Cc1ccccc1)NC(=O)OCc1ccccc1