Reaction Details
TargetReverse transcriptase/RNaseH
LigandBDBM50286543
Substrate/Competitorn/a
Meas. Tech.ChEMBL_195376 (CHEMBL802413)
IC50 210±n/a nM
Citation Young, SDAmblard, MCBritcher, SFGrey, VETran, LOLumma, WCHuff, JRSchleif, WAEmini, EEO'Brien, JAPettibone, DJ 2-Heterocyclic indole-3-sulfones as inhibitors of HIV-1 reverse transcriptase Bioorg Med Chem Lett5:491-496 (1995)    Article
 
Reverse transcriptase/RNaseH
Name:Reverse transcriptase/RNaseH
Type:PROTEIN
Mol. Mass.:65229.15
Organism:Human immunodeficiency virus 1
Description:ChEMBL_1473730
Residue:566
BDBM50286543
NameBDBM50286543
Synonyms:3-Benzenesulfonyl-5-chloro-2-(4-methyl-5-propyl-1H-imidazol-2-yl)-1H-indole | CHEMBL147210
TypeSmall organic molecule
Emp. Form.C21H20ClN3O2S
Mol. Mass.413.92
SMILESCCCc1[nH]c(nc1C)-c1[nH]c2ccc(Cl)cc2c1S(=O)(=O)c1ccccc1