Reaction Details
TargetGag-Pol polyprotein [489-587]
LigandBDBM50286548
Substrate/Competitorn/a
Meas. Tech.ChEBML_195356
IC50 10±n/a nM
Citation Young, SDAmblard, MCBritcher, SFGrey, VETran, LOLumma, WCHuff, JRSchleif, WAEmini, EEO'Brien, JAPettibone, DJ 2-Heterocyclic indole-3-sulfones as inhibitors of HIV-1 reverse transcriptase Bioorg Med Chem Lett5:491-496 (1995)    Article
 
Gag-Pol polyprotein [489-587]
Name:Gag-Pol polyprotein [489-587]
Type:Enzyme Subunit
Mol. Mass.:10781.16
Organism:Human immunodeficiency virus type 1
Description:P04585[489-587]
Residue:99
BDBM50286548
NameBDBM50286548
Synonyms:3-Benzenesulfonyl-5-chloro-2-(4,5-diethyl-1H-imidazol-2-yl)-1H-indole | CHEMBL341883
TypeSmall organic molecule
Emp. Form.C21H20ClN3O2S
Mol. Mass.413.92
SMILESCCc1nc([nH]c1CC)-c1[nH]c2ccc(Cl)cc2c1S(=O)(=O)c1ccccc1