Reaction Details
TargetGag-Pol polyprotein [489-587]
LigandBDBM50286553
Substrate/Competitorn/a
Meas. Tech.ChEBML_195356
IC50 2385±n/a nM
Citation Young, SDAmblard, MCBritcher, SFGrey, VETran, LOLumma, WCHuff, JRSchleif, WAEmini, EEO'Brien, JAPettibone, DJ 2-Heterocyclic indole-3-sulfones as inhibitors of HIV-1 reverse transcriptase Bioorg Med Chem Lett5:491-496 (1995)    Article
 
Gag-Pol polyprotein [489-587]
Name:Gag-Pol polyprotein [489-587]
Type:Enzyme Subunit
Mol. Mass.:10781.16
Organism:Human immunodeficiency virus type 1
Description:P04585[489-587]
Residue:99
BDBM50286553
NameBDBM50286553
Synonyms:3-Benzenesulfonyl-5-chloro-2-imidazol-1-yl-1H-indole | CHEMBL144356
TypeSmall organic molecule
Emp. Form.C17H12ClN3O2S
Mol. Mass.357.814
SMILESClc1ccc2[nH]c(c(c2c1)S(=O)(=O)c1ccccc1)-n1ccnc1