Reaction Details
TargetProtein kinase C alpha type
LigandBDBM2683
Substrate/Competitorn/a
Meas. Tech.ChEBML_160268
IC50 10±n/a nM
Citation Xie, GZimmermann, JMeyer, TLown, JW Protein kinase C-α inhibitors; structure-activity relationships in bis-indole series Bioorg Med Chem Lett5:497-500 (1995)    Article
 
Protein kinase C alpha type
Name:Protein kinase C alpha type
Type:Enzyme
Mol. Mass.:76755.65
Organism:Homo sapiens (Human)
Description:The recombinant human PKC enzymes were produced using a baculovirus expression system in SF9 cells
Residue:672
BDBM2683
NameBDBM2683
Synonyms:2-[1-(3-dimethylaminopropyl)-indol-3-yl]-3-(indol-3-yl)maleimide BIM-1 GF 109203X | JMC526193 Compound 2
TypeSmall organic molecule
Emp. Form.C25H24N4O2
Mol. Mass.412.4837
SMILESCN(C)CCCn1cc(C2=C(C(=O)NC2=O)c2c[nH]c3ccccc23)c2ccccc12