Reaction Details
TargetRetinoic acid receptor beta
LigandBDBM50286563
Substrate/Competitorn/a
Meas. Tech.ChEMBL_195648 (CHEMBL795966)
EC50>5±n/a nM
Citation Chandraratna, RAGillett, SJSong, TKAttard, JVuligonda, SGarst, MEArefieg, TGil, DWWheeler, L Synthesis and pharmacological activity of conformationally restricted, acetylenic retinoid analogs Bioorg Med Chem Lett5:523-527 (1995)    Article
 
Retinoic acid receptor beta
Name:Retinoic acid receptor beta
Type:PROTEIN
Mol. Mass.:50498.70
Organism:Homo sapiens (Human)
Description:ChEMBL_1458015
Residue:455
BDBM50286563
NameBDBM50286563
Synonyms:6-[(E)-4-(2,6,6-Trimethyl-cyclohex-1-enyl)-but-3-en-1-ynyl]-nicotinic acid | CHEMBL150691
TypeSmall organic molecule
Emp. Form.C19H21NO2
Mol. Mass.295.3755
SMILESCC1=C(\C=C\C#Cc2ccc(cn2)C(O)=O)C(C)(C)CCC1