Reaction Details
TargetGag-Pol polyprotein [489-587]
LigandBDBM50286689
Substrate/Competitorn/a
Meas. Tech.ChEBML_159623
IC50 1.1±n/a nM
Citation Kaldor, SWAppelt, KFritz, JEHammond, MCrowell, TABaxter, AJHatch, SDWiskerchen, MMuesing, MA A systematic study of P1–P3 spanning sidechains for the inhibition of HIV-1 protease Bioorg Med Chem Lett5:715-720 (1995)    Article
 
Gag-Pol polyprotein [489-587]
Name:Gag-Pol polyprotein [489-587]
Type:Enzyme Subunit
Mol. Mass.:10781.16
Organism:Human immunodeficiency virus type 1
Description:P04585[489-587]
Residue:99
BDBM50286689
NameBDBM50286689
Synonyms:(S)-N*1*-[(1R,2R)-3-(2-tert-Butylcarbamoyl-phenyl)-2-hydroxy-1-phenylsulfanylmethyl-propyl]-2-[(quinoline-2-carbonyl)-amino]-succinamide | CHEMBL163045
TypeSmall organic molecule
Emp. Form.C35H39N5O5S
Mol. Mass.641.78
SMILESCC(C)(C)NC(=O)c1ccccc1C[C@@H](O)[C@H](CSc1ccccc1)NC(=O)[C@H](CC(N)=O)NC(=O)c1ccc2ccccc2n1