Reaction Details
TargetGag-Pol polyprotein [489-587]
LigandBDBM50213826
Substrate/Competitorn/a
Meas. Tech.ChEMBL_159623 (CHEMBL881019)
IC50<0.250000±n/a nM
Citation Kaldor, SWAppelt, KFritz, JEHammond, MCrowell, TABaxter, AJHatch, SDWiskerchen, MMuesing, MA A systematic study of P1–P3 spanning sidechains for the inhibition of HIV-1 protease Bioorg Med Chem Lett5:715-720 (1995)    Article
 
Gag-Pol polyprotein [489-587]
Name:Gag-Pol polyprotein [489-587]
Type:Enzyme Subunit
Mol. Mass.:10781.16
Organism:Human immunodeficiency virus type 1
Description:P04585[489-587]
Residue:99
BDBM50213826
NameBDBM50213826
Synonyms:CHEMBL164045
TypeSmall organic molecule
Emp. Form.C39H41N5O5S
Mol. Mass.691.838
SMILESCC(C)(C)NC(=O)c1ccccc1C[C@@H](O)[C@H](CSc1ccc2ccccc2c1)NC(=O)[C@H](CC(N)=O)NC(=O)c1ccc2ccccc2n1