Reaction Details
TargetGag-Pol polyprotein [489-587]
LigandBDBM50286699
Substrate/Competitorn/a
Meas. Tech.ChEBML_157737
Ki 15±n/a nM
Citation Kalish, VJTatlock, JHDavies, JFKaldor, SWDressman, BAReich, SPino, MNyugen, DAppelt, KMusick, LWu, Bw Structure-based drug design of nonpeptidic P2 substituents for HIV-1 protease inhibitors Bioorg Med Chem Lett5:727-732 (1995)    Article
 
Gag-Pol polyprotein [489-587]
Name:Gag-Pol polyprotein [489-587]
Type:Enzyme Subunit
Mol. Mass.:10781.16
Organism:Human immunodeficiency virus type 1
Description:P04585[489-587]
Residue:99
BDBM50286699
NameBDBM50286699
Synonyms:AG-1309 N-[(1R,2R)-3-(2-tert-Butylcarbamoyl-phenyl)-2-hydroxy-1-(naphthalen-2-ylsulfanylmethyl)-propyl]-2-chloro-3-hydroxy-benzamide
TypeSmall organic molecule
Emp. Form.C32H33ClN2O4S
Mol. Mass.577.133
SMILESCC(C)(C)NC(=O)c1ccccc1C[C@@H](O)[C@H](CSc1ccc2ccccc2c1)NC(=O)c1cccc(O)c1Cl