Reaction Details
TargetGag-Pol polyprotein [489-587]
LigandBDBM50061307
Substrate/Competitorn/a
Meas. Tech.ChEBML_157737
Ki 3±n/a nM
Citation Kalish, VJTatlock, JHDavies, JFKaldor, SWDressman, BAReich, SPino, MNyugen, DAppelt, KMusick, LWu, Bw Structure-based drug design of nonpeptidic P2 substituents for HIV-1 protease inhibitors Bioorg Med Chem Lett5:727-732 (1995)    Article
 
Gag-Pol polyprotein [489-587]
Name:Gag-Pol polyprotein [489-587]
Type:Enzyme Subunit
Mol. Mass.:10781.16
Organism:Human immunodeficiency virus type 1
Description:P04585[489-587]
Residue:99
BDBM50061307
NameBDBM50061307
Synonyms:AG-1254 N-[(1R,2R)-3-(2-tert-Butylcarbamoyl-phenyl)-2-hydroxy-1-(naphthalen-2-ylsulfanylmethyl)-propyl]-3-hydroxy-2-methyl-benzamide
TypeSmall organic molecule
Emp. Form.C33H36N2O4S
Mol. Mass.556.715
SMILESCc1c(O)cccc1C(=O)N[C@@H](CSc1ccc2ccccc2c1)[C@H](O)Cc1ccccc1C(=O)NC(C)(C)C