Reaction Details
TargetPotassium-transporting ATPase alpha chain 2
LigandBDBM50286739
Substrate/Competitorn/a
Meas. Tech.ChEBML_144115
IC50 200000±n/a nM
Citation Haruna, MTanaka, MSugimoto, TKojima, RSuzuki, YKonoshima, TKozuka, MIto, K Alteration of Na+ permeability in human erythrocytes as studied by 23Na-NMR and inhibition of the kidney Na+,K+-ATPase activities with saponins: Interaction of Gleditsia saponins with human erythrocyte membranes Bioorg Med Chem Lett5:827-830 (1995)    Article
 
Potassium-transporting ATPase alpha chain 2
Name:Potassium-transporting ATPase alpha chain 2
Type:PROTEIN
Mol. Mass.:115509.17
Organism:Homo sapiens (Human)
Description:ChEMBL_144101
Residue:1039
BDBM50286739
NameBDBM50286739
Synonyms:4-((1R,3S,5S,8R,10R,11R,13R,14S,17R)-1,5,11,14-tetrahydroxy-10-(hydroxymethyl)-13-methyl-3-((2R,3R,4R,5R,6S)-3,4,5-trihydroxy-6-methyl-tetrahydro-2H-pyran-2-yloxy)-hexadecahydro-1H-cyclopenta[a]phenanthren-17-yl)furan-2(5H)-one 4-[(1R,3S,5S,10R,11R,13R,14S,17R)-1,5,11,14-Tetrahydroxy-10-hydroxymethyl-13-methyl-3-((2R,3R,4R,5R,6S)-3,4,5-trihydroxy-6-methyl-tetrahydro-pyran-2-yloxy)-hexadecahydro-cyclopenta[a]phenanthren-17-yl]-5H-furan-2-one 4-[1,5,11,14-Tetrahydroxy-10-hydroxymethyl-13-methyl-3-(3,4,5-trihydroxy-6-methyl-tetrahydro-pyran-2-yloxy)-hexadecahydro-cyclopenta[a]phenanthren-17-yl]-5H-furan-2-one CHEMBL222863 Ouabain cid_439501
TypeSmall organic molecule
Emp. Form.C29H44O12
Mol. Mass.584.6525
SMILESC[C@@H]1O[C@@H](O[C@H]2C[C@@H](O)[C@]3(CO)[C@H]4[C@H](O)C[C@]5(C)[C@H](CC[C@]5(O)[C@@H]4CC[C@]3(O)C2)C2=CC(=O)OC2)[C@H](O)[C@H](O)[C@H]1O