Reaction Details
TargetCysteinyl leukotriene receptor 1
LigandBDBM50286748
Substrate/Competitorn/a
Meas. Tech.ChEBML_99991
Ki>50000±n/a nM
Citation Masamune, HBreslow, RCheng, JBConklyn, MJEggler, JFMarfat, AMelvin, LSPillar, JSShirley, JTShowell, HJTickner, JE Synthesis and in vitro profile of 7-substituted quinoline chromanols as novel, non-acidic LTB4 antagonists Bioorg Med Chem Lett5:887-892 (1995)    Article
 
Cysteinyl leukotriene receptor 1
Name:Cysteinyl leukotriene receptor 1
Type:Enzyme Catalytic Domain
Mol. Mass.:39007.58
Organism:GUINEA PIG
Description:Leukotriene D4 0 GUINEA PIG::Q2NNR5
Residue:340
BDBM50286748
NameBDBM50286748
Synonyms:(3R,4S)-3-Pyridin-2-ylmethyl-7-(1-quinolin-2-yl-ethoxy)-chroman-4-ol | CHEMBL168854
TypeSmall organic molecule
Emp. Form.C26H24N2O3
Mol. Mass.412.4804
SMILESCC(Oc1ccc2[C@@H](O)[C@H](Cc3ccccn3)COc2c1)c1ccc2ccccc2n1