Reaction Details
TargetLeukotriene B4 receptor 1
LigandBDBM50286747
Substrate/Competitorn/a
Meas. Tech.ChEBML_99655
Ki 330±n/a nM
Citation Masamune, HBreslow, RCheng, JBConklyn, MJEggler, JFMarfat, AMelvin, LSPillar, JSShirley, JTShowell, HJTickner, JE Synthesis and in vitro profile of 7-substituted quinoline chromanols as novel, non-acidic LTB4 antagonists Bioorg Med Chem Lett5:887-892 (1995)    Article
 
Leukotriene B4 receptor 1
Name:Leukotriene B4 receptor 1
Type:Enzyme Catalytic Domain
Mol. Mass.:37582.68
Organism:Homo sapiens (Human)
Description:Q15722
Residue:352
BDBM50286747
NameBDBM50286747
Synonyms:(3R,4S)-3-Pyridin-3-ylmethyl-7-((R)-1-quinolin-2-yl-ethoxy)-chroman-4-ol | CHEMBL172457
TypeSmall organic molecule
Emp. Form.C26H24N2O3
Mol. Mass.412.4804
SMILESC[C@@H](Oc1ccc2[C@@H](O)[C@H](Cc3cccnc3)COc2c1)c1ccc2ccccc2n1