Reaction Details
TargetEndothelin-1 receptor
LigandBDBM50286797
Substrate/Competitorn/a
Meas. Tech.ChEBML_65333
IC50>3500±n/a nM
Citation Terrett, NKBojanic, DBrown, DBungay, PJGardner, MGordon, DWMayers, CJSteele, J The combinatorial synthesis of a 30,752-compound library: discovery of SAR around the endothelin antagonist, FR-139,317 Bioorg Med Chem Lett5:917-922 (1995)    Article
 
Endothelin-1 receptor
Name:Endothelin-1 receptor
Type:Enzyme Catalytic Domain
Mol. Mass.:48736.88
Organism:Homo sapiens (Human)
Description:P25101
Residue:427
BDBM50286797
NameBDBM50286797
Synonyms:(R)-2-[(R)-2-{(S)-2-[(Azepane-1-carbonyl)-amino]-4-methyl-pentanoylamino}-3-(1-methyl-1H-indol-3-yl)-propionylamino]-succinamic acid | CHEMBL355384
TypeSmall organic molecule
Emp. Form.C29H42N6O6
Mol. Mass.570.6804
SMILESCC(C)C[C@H](NC(=O)N1CCCCCC1)C(=O)N[C@H](Cc1cn(C)c2ccccc12)C(=O)N[C@H](CC(N)=O)C(O)=O