Reaction Details
TargetEndothelin-1 receptor
LigandBDBM50286803
Substrate/Competitorn/a
Meas. Tech.ChEBML_65333
IC50 1320±n/a nM
Citation Terrett, NKBojanic, DBrown, DBungay, PJGardner, MGordon, DWMayers, CJSteele, J The combinatorial synthesis of a 30,752-compound library: discovery of SAR around the endothelin antagonist, FR-139,317 Bioorg Med Chem Lett5:917-922 (1995)    Article
 
Endothelin-1 receptor
Name:Endothelin-1 receptor
Type:Enzyme Catalytic Domain
Mol. Mass.:48736.88
Organism:Homo sapiens (Human)
Description:P25101
Residue:427
BDBM50286803
NameBDBM50286803
Synonyms:(S)-2-[(R)-2-{(S)-2-[(Azepane-1-carbonyl)-amino]-4-methyl-pentanoylamino}-3-(1-methyl-1H-indol-3-yl)-propionylamino]-4-methyl-pentanoic acid | CHEMBL170229
TypeSmall organic molecule
Emp. Form.C31H47N5O5
Mol. Mass.569.7354
SMILESCC(C)C[C@H](NC(=O)[C@@H](Cc1cn(C)c2ccccc12)NC(=O)[C@H](CC(C)C)NC(=O)N1CCCCCC1)C(O)=O