Reaction Details
TargetBile salt-activated lipase
LigandBDBM50286879
Substrate/Competitorn/a
Meas. Tech.ChEMBL_154778 (CHEMBL761498)
Ki 30000±n/a nM
Citation Lin, GLiu, HCTsai, YC Atropisomeric carbamoyl type inhibitors of pancreatic cholesterol esterase Bioorg Med Chem Lett6:43-46 (1996)    Article
 
Bile salt-activated lipase
Name:Bile salt-activated lipase
Type:PROTEIN
Mol. Mass.:65152.77
Organism:Bos taurus
Description:ChEMBL_154778
Residue:597
BDBM50286879
NameBDBM50286879
Synonyms:Butyl-carbamic acid 2'-butylcarbamoyloxy-[1,1']binaphthalenyl-2-yl ester | CHEMBL141926
TypeSmall organic molecule
Emp. Form.C30H32N2O4
Mol. Mass.484.5861
SMILESCCCCNC(=O)Oc1ccc2ccccc2c1-c1c(OC(=O)NCCCC)ccc2ccccc12