Reaction Details
TargetIntegrin alpha-IIb/beta-3
LigandBDBM50059688
Substrate/Competitorn/a
Meas. Tech.ChEMBL_218201 (CHEMBL824550)
IC50 100±n/a nM
Citation Sall, DJArfsten, AEBerry, DRDenney, MLHarms, CSMcCowan, JRRay, JKScarborough, RMUm, SLUtterback, BGJakubowski, JA Platelet glycoprotein IIb–IIIa receptor (GPIIb–IIIa) antagonists derived from amidinoindoles Bioorg Med Chem Lett6:81-86 (1996)    Article
 
Integrin alpha-IIb/beta-3
Name:Integrin alpha-IIb/beta-3
Synonyms:Glycoprotein IIb/IIIa
Type:n/a
Mol. Mass.:n/a
Description:ASSAY_ID of EBI is 30109
Components:This complex has 2 components.
Component 1
Name:Integrin beta-3
Type:Protein
Mol. Mass.:87038.91
Organism:Homo sapiens (Human)
Description:P05106
Residue:788
Component 2
Name:Integrin alpha-IIb
Synonyms:CD_antigen=CD41 GPIIb Glycoprotein IIb ITGA2B Integrin alpha-IIb heavy chain Integrin alpha-IIb light chain, form 2 Integrin alpha-V/beta-3 and alpha-IIb/beta 3 | Platelet membrane glycoprotein IIb
Type:Protein
Mol. Mass.:113354.85
Organism:Homo sapiens (Human)
Description:P08514
Residue:1039
BDBM50059688
NameBDBM50059688
Synonyms:7-[(6-Carbamimidoyl-1H-indole-3-carbonyl)-amino]-heptanoic acid | CHEMBL318493
TypeSmall organic molecule
Emp. Form.C17H22N4O3
Mol. Mass.330.3816
SMILESNC(=N)c1ccc2c(c[nH]c2c1)C(=O)NCCCCCCC(O)=O