Reaction Details
TargetProstaglandin G/H synthase 1
LigandBDBM50029600
Substrate/Competitorn/a
Meas. Tech.ChEBML_158924
IC50 600±n/a nM
Citation Gauthier, JYLeblanc, YBlack, WCChan, CCCromlish, WAGordon, RKennedey, BPLau, CKLéger, SWang, ZEthier, DGuay, JMancini, JRiendeau, DTagari, PVickers, PWong, EXu, LPrasit, P Synthesis and biological evaluation of 2,3-diarylthiophenes as selective cox-2 inhibitors. part II: Replacing the heterocycle Bioorg Med Chem Lett6:87-92 (1996)    Article
 
Prostaglandin G/H synthase 1
Name:Prostaglandin G/H synthase 1
Type:Enzyme
Mol. Mass.:68692.62
Organism:Homo sapiens (Human)
Description:P23219
Residue:599
BDBM50029600
NameBDBM50029600
Synonyms:5-Bromo-2-(4-fluoro-phenyl)-3-(4-methanesulfonyl-phenyl)-thiophene CHEMBL42485 | DUP-697
TypeSmall organic molecule
Emp. Form.C17H12BrFO2S2
Mol. Mass.411.308
SMILESCS(=O)(=O)c1ccc(cc1)-c1cc(Br)sc1-c1ccc(F)cc1