Reaction Details
TargetProstaglandin G/H synthase 2
LigandBDBM50029600
Substrate/Competitorn/a
Meas. Tech.ChEBML_159917
IC50 7±n/a nM
Citation Gauthier, JYLeblanc, YBlack, WCChan, CCCromlish, WAGordon, RKennedey, BPLau, CKLéger, SWang, ZEthier, DGuay, JMancini, JRiendeau, DTagari, PVickers, PWong, EXu, LPrasit, P Synthesis and biological evaluation of 2,3-diarylthiophenes as selective cox-2 inhibitors. part II: Replacing the heterocycle Bioorg Med Chem Lett6:87-92 (1996)    Article
 
Prostaglandin G/H synthase 2
Name:Prostaglandin G/H synthase 2
Type:Enzyme
Mol. Mass.:69003.89
Organism:Homo sapiens (Human)
Description:Recombinant Cox-2 provided by Cayman (Cayman Chemical Co.,Ann Arbor, MI).
Residue:604
BDBM50029600
NameBDBM50029600
Synonyms:5-Bromo-2-(4-fluoro-phenyl)-3-(4-methanesulfonyl-phenyl)-thiophene CHEMBL42485 | DUP-697
TypeSmall organic molecule
Emp. Form.C17H12BrFO2S2
Mol. Mass.411.308
SMILESCS(=O)(=O)c1ccc(cc1)-c1cc(Br)sc1-c1ccc(F)cc1