Reaction Details
TargetPlatelet-derived growth factor receptor alpha/beta
LigandBDBM50287090
Substrate/Competitorn/a
Meas. Tech.ChEMBL_152441 (CHEMBL761266)
IC50 10±n/a nM
Citation Zimmermann, JBuchdunger, EMett, HMeyer, TLydon, NBTraxler, P Phenylamino-pyrimidine (PAP) — derivatives: a new class of potent and highly selective PDGF-receptor autophosphorylation inhibitors Bioorg Med Chem Lett6:1221-1226 (1996)    Article
 
Platelet-derived growth factor receptor alpha/beta
Name:Platelet-derived growth factor receptor alpha/beta
Type:n/a
Mol. Mass.:n/a
Description:ASSAY_ID of EBI is 29498
Components:This complex has 2 components.
Component 1
Name:Platelet-derived growth factor receptor beta
Synonyms:Beta-type platelet-derived growth factor receptor CD140b antigen PDGF Receptor Substrate PDGFR PDGFR-1 PDGFRB PGFRB_HUMAN Platelet-derived growth factor receptor 1 Platelet-derived growth factor receptor beta (PDGFR-beta) Platelet-derived growth factor receptor beta (PDGFRbeta) | VHL/PDGFRB
Type:Enzyme
Mol. Mass.:123922.25
Organism:Homo sapiens (Human)
Description:P09619
Residue:1106
Component 2
Name:Platelet-derived growth factor receptor alpha
Synonyms:Alpha-type platelet-derived growth factor receptor PDGFRA PGFRA_HUMAN Platelet-derived growth factor receptor alpha (PDGFRA) RHEPDGFRA
Type:Protein
Mol. Mass.:122633.38
Organism:Homo sapiens (Human)
Description:P16234
Residue:1089
BDBM50287090
NameBDBM50287090
Synonyms:4-Chloro-N-[4-methyl-3-(4-pyridin-3-yl-pyrimidin-2-ylamino)-phenyl]-benzamide | CHEMBL21162
TypeSmall organic molecule
Emp. Form.C23H18ClN5O
Mol. Mass.415.875
SMILESCc1ccc(NC(=O)c2ccc(Cl)cc2)cc1Nc1nccc(n1)-c1cccnc1