Reaction Details
TargetSqualene synthase
LigandBDBM50287118
Substrate/Competitorn/a
Meas. Tech.ChEBML_202100
IC50 500±n/a nM
Citation Lamothe, MPerrin, DBlotières, DLeborgne, MGras, SBonnet, DHill, BTHalazy, S Inhibition of farnesyl protein transferase by new farnesyl phosphonate derivatives of phenylalanine Bioorg Med Chem Lett6:1291-1296 (1996)    Article
 
Squalene synthase
Name:Squalene synthase
Type:PROTEIN
Mol. Mass.:48109.41
Organism:Rattus norvegicus
Description:ChEMBL_1336736
Residue:416
BDBM50287118
NameBDBM50287118
Synonyms:(R)-3-Phenyl-2-((4E,8E)-5,9,13-trimethyl-2-phosphono-tetradeca-4,8,12-trienoylamino)-propionic acid | CHEMBL285362
TypeSmall organic molecule
Emp. Form.C26H38NO6P
Mol. Mass.491.5568
SMILES[#6]-[#6](-[#6]-[#6]\[#6]=[#6](/[#6])-[#6]-[#6]\[#6]=[#6](\[#6])-[#6])-[#6]-[#6]=[#6](-[#6](=O)-[#7]-[#6@H](-[#6]-c1ccccc1)-[#6](-[#8])=O)P([#8])([#8])=O