Reaction Details
TargetProthrombin
LigandBDBM50287153
Substrate/Competitorn/a
Meas. Tech.ChEBML_207954
IC50 36000±n/a nM
Citation Iwanowicz, EJLau, WFLin, JRoberts, DGSeiler, SM Derivatives of 5-amidine indole as inhibitors of thrombin catalytic activity Bioorg Med Chem Lett6:1339-1344 (1996)    Article
 
Prothrombin
Name:Prothrombin
Type:Protein
Mol. Mass.:70029.57
Organism:Homo sapiens (Human)
Description:P00734
Residue:622
BDBM50287153
NameBDBM50287153
Synonyms:2-(2-Fluoro-benzyl)-1H-indole-5-carboxamidine | CHEMBL27305
TypeSmall organic molecule
Emp. Form.C16H14FN3
Mol. Mass.267.3009
SMILESNC(=N)c1ccc2[nH]c(Cc3ccccc3F)cc2c1