Reaction Details
TargetProthrombin
LigandBDBM50287154
Substrate/Competitorn/a
Meas. Tech.ChEBML_207954
IC50 2400±n/a nM
Citation Iwanowicz, EJLau, WFLin, JRoberts, DGSeiler, SM Derivatives of 5-amidine indole as inhibitors of thrombin catalytic activity Bioorg Med Chem Lett6:1339-1344 (1996)    Article
 
Prothrombin
Name:Prothrombin
Type:Protein
Mol. Mass.:70029.57
Organism:Homo sapiens (Human)
Description:P00734
Residue:622
BDBM50287154
NameBDBM50287154
Synonyms:2-(3-Phenethyl-benzyl)-1H-indole-5-carboxamidine | CHEMBL27758
TypeSmall organic molecule
Emp. Form.C24H23N3
Mol. Mass.353.4595
SMILESNC(=N)c1ccc2[nH]c(Cc3cccc(CCc4ccccc4)c3)cc2c1