Reaction Details
TargetD(2) dopamine receptor
LigandBDBM50287178
Substrate/Competitorn/a
Meas. Tech.ChEBML_60231
Ki 151±n/a nM
Citation Glase, SAAkunne, HCHeffner, TGJohnson, SJKesten, SRMacKenzie, RGManley, PJPugsley, TAWright, JLWise, LD 4-bromo-1-methoxy-N-[2-(4-aryl-1-piperazinyl)ethyl]-2-naphthalenecarboxamides: Selective dopamine D3 receptor partial agonists Bioorg Med Chem Lett6:1361-1366 (1996)    Article
 
D(2) dopamine receptor
Name:D(2) dopamine receptor
Type:Cell-surface receptors
Mol. Mass.:50647.10
Organism:Homo sapiens (Human)
Description:P14416
Residue:443
BDBM50287178
NameBDBM50287178
Synonyms:4-Bromo-1-methoxy-naphthalene-2-carboxylic acid {2-[4-(2-nitro-phenyl)-piperazin-1-yl]-ethyl}-amide | CHEMBL29436
TypeSmall organic molecule
Emp. Form.C24H25BrN4O4
Mol. Mass.513.384
SMILESCOc1c(cc(Br)c2ccccc12)C(=O)NCCN1CCN(CC1)c1ccccc1[N+]([O-])=O