Reaction Details
TargetArachidonate 5-lipoxygenase-activating protein/Polyunsaturated fatty acid 5-lipoxygenase
LigandBDBM50287328
Substrate/Competitorn/a
Meas. Tech.ChEMBL_89925 (CHEMBL873225)
IC50 600±n/a nM
Citation Woods, KWBrooks, CDMaki, RGRodriques, KEBouska, JBYoung, PBell, RLCarter, GW O-alkylcarboxylate oxime and N-hydroxyurea analogs of substituted indole leukotriene biosynthesis inhibitors Bioorg Med Chem Lett6:1547-1552 (1996)    Article
 
Arachidonate 5-lipoxygenase-activating protein/Polyunsaturated fatty acid 5-lipoxygenase
Name:Arachidonate 5-lipoxygenase-activating protein/Polyunsaturated fatty acid 5-lipoxygenase
Synonyms:5-Lipoxygenase/5-lipoxygenase activating protein
Type:n/a
Mol. Mass.:n/a
Description:ASSAY_ID of EBI is 88346
Components:This complex has 2 components.
Component 1
Name:Polyunsaturated fatty acid 5-lipoxygenase
Type:Enzyme
Mol. Mass.:77972.74
Organism:Homo sapiens (Human)
Description:Recombinant protein was purified from E. coli lysate. After ammonium sulfate precipitation and subsequent steps, the supernatant (S100) was used for 5-LO activity assay.
Residue:674
Component 2
Name:Arachidonate 5-lipoxygenase-activating protein
Synonyms:5-lipoxygenase activating protein 5-lipoxygenase/FLAP ALOX5AP MK-886-binding protein
Type:Enzyme
Mol. Mass.:18159.90
Organism:Homo sapiens (Human)
Description:P20292
Residue:161
BDBM50287328
NameBDBM50287328
Synonyms:CHEMBL38513 | [3-[3-tert-Butylsulfanyl-1-(4-chloro-benzyl)-5-(pyridin-2-ylmethoxy)-1H-indol-2-yl]-2,2-dimethyl-prop-(E)-ylideneaminooxy]-acetic acid
TypeSmall organic molecule
Emp. Form.C32H36ClN3O4S
Mol. Mass.594.164
SMILESCC(C)(C)Sc1c(CC(C)(C)\C=N\OCC(O)=O)n(Cc2ccc(Cl)cc2)c2ccc(OCc3ccccn3)cc12