Reaction Details
TargetMu-type opioid receptor
LigandBDBM50287333
Substrate/Competitorn/a
Meas. Tech.ChEBML_136063
IC50 5.8±n/a nM
Citation Hutchinson, IArcher, SHill, KPBidlack, JM Synthesis and opioid binding properties of 2-chloroacrylamido derivatives of 7,8-dihydromorphinans Bioorg Med Chem Lett6:1563-1566 (1996)    Article
 
Mu-type opioid receptor
Name:Mu-type opioid receptor
Type:Enzyme Catalytic Domain
Mol. Mass.:45038.37
Organism:CALF
Description:OPIATE Mu 2 0 CALF::P79350
Residue:401
BDBM50287333
NameBDBM50287333
Synonyms:1N-[10-hydroxy-4-methyl-14-oxo-(13R,17S)-12-oxa-4-azapentacyclo[9.6.1.01,13.05,17.07,18]octadeca-7(18),8,10-trien-17-yl]-2-chloroacrylamide | CHEMBL290616
TypeSmall organic molecule
Emp. Form.C20H21ClN2O4
Mol. Mass.388.845
SMILESCN1CCC23[C@H]4Oc5c2c(CC1[C@@]3(CCC4=O)NC(=O)C(Cl)=C)ccc5O