Reaction Details
TargetMatrilysin
LigandBDBM50287376
Substrate/Competitorn/a
Meas. Tech.ChEBML_102104
IC50 1±n/a nM
Citation Chen, JJZhang, YHammond, SDewdney, NHo, TLin, XBrowner, MFCastelhano, AL Design, synthesis, activity, and structure of a novel class of matrix metalloproteinase inhibitors containing a heterocyclic P2′-P3′ amide bond isostere Bioorg Med Chem Lett6:1601-1606 (1996)    Article
 
Matrilysin
Name:Matrilysin
Type:Enzyme
Mol. Mass.:29681.54
Organism:Homo sapiens (Human)
Description:P09237
Residue:267
BDBM50287376
NameBDBM50287376
Synonyms:2-[(S)-1-((R)-2-Hydroxycarbamoylmethyl-4-methyl-pentanoylamino)-3-methyl-butyl]-3H-benzoimidazole-5-carboxylic acid methyl ester | CHEMBL40351
TypeSmall organic molecule
Emp. Form.C22H32N4O5
Mol. Mass.432.5133
SMILESCOC(=O)c1ccc2nc([nH]c2c1)[C@H](CC(C)C)NC(=O)[C@H](CC(C)C)CC(=O)NO